{"text_format":"1","workbook":"xlsx","n_sheets":3,"sheets":["Sida1","Loggbok","Avst"],"not_rendered":{"charts":0,"images":1,"macros":0,"external_links":0,"defined_names":5,"comments":2,"pivot_tables":0},"unopened":[],"bounds":{"document_bytes":16777216,"sheet_cells":100000,"rows_first":2000,"rows_last":500,"rows_between":2000,"halvings":0,"cell_chars":16384,"cell_head_chars":4096},"cells_cut":0,"cells_raw":0,"read":"whole","date_system":"1900"}

{"sheet":"Sida1","index":0,"n_rows":62,"n_cols":12,"rows_kept":62,"cut":false,"hidden":false,"merged":[[9,2,9,5],[9,6,9,9],[9,10,9,11],[4,9,5,9],[5,0,6,5],[7,6,7,7],[7,8,7,11],[8,0,8,5],[8,6,8,7],[8,9,8,11],[3,4,3,5],[3,6,3,7],[4,6,5,6],[4,7,5,7],[4,8,5,8],[12,10,13,11],[13,0,13,2],[13,3,13,5],[14,10,15,11],[14,7,15,8],[14,0,15,2],[14,3,15,5],[14,6,15,6],[14,9,15,9],[18,6,18,7],[18,0,18,4],[10,0,10,1],[10,2,10,5],[10,6,10,9],[16,0,16,1],[16,6,16,11],[17,0,17,4],[17,6,17,7],[17,9,17,10],[10,10,10,11],[11,0,12,1],[11,2,12,5],[11,6,11,9],[11,10,11,11],[12,6,13,9],[19,0,19,5],[20,0,20,4],[21,0,22,5],[31,0,31,4],[32,0,32,4],[23,0,23,4],[23,9,25,11],[24,0,25,5],[26,0,26,4],[28,0,28,4],[28,6,33,11],[29,0,29,5],[30,0,30,4],[34,0,34,4],[34,6,35,9],[34,10,35,11],[35,0,36,5],[37,0,37,4],[37,6,39,11],[38,0,38,5]]}
[null,null,null,null,null,null,null,null,"Version: StA 2015_A"]
[]
[null,null,"SVENSKA KRYSSARKLUBBEN"]
[null,null,null,null,"LOGGBOK",null,"Seglingsperiod",null,24,"timmar"]
["Befälhavare",null,null,null,null,null,"Havs-segling","Kust-segling","Höst","Vår"]
[null,null,null,null,null,null,null,null,null,null,"År"]
[null,null,null,null,null,null,null,null,null,null,{"$f":"NOW()","v":"2015-06-03T21:19:29.110"}]
["Utdelningsadress",null,null,null,null,null,"Startnummer ",null,"Startplats"]
[null,null,null,null,null,null,null,null,"Startpunkt",{"$f":"VLOOKUP(I9,Avst!I:J,2,FALSE)","v":{"$error":"#N/A"}}]
["Postnummer ",null,"Postort",null,null,null,"Båtnamn ",null,null,null,"Segelnummer"]
[]
["Födelsedatum \n(6 siffror)",null,null,null,null,null,"Båttyp ",null,null,null,"SXK-Tal"]
[]
["Tel bostad ",null,null,"Tel arbete"]
[null,null,null,null,null,null,null,"Har deltagit tidigare som befälhavare",null,null,"Har EJ deltagit tidigare som befälhavare"]
[]
["Skriv i gula fält!",null,null,null,null,null,"Beräkning av resulterande distans"]
["SAMTLIGA FÖLJANDE UPPGIFTER SKALL LÄMNAS",null,null,null,null,null,"Start kl",null,{"$f":"Loggbok!L4","v":"00:00:00"}]
["1. Vid start",null,null,null,null,null,"Målgång kl",null,{"$f":"VLOOKUP(\"M\",Loggbok!F4:L105,7,FALSE)","v":"00:00:00"},"Försening","F",{"$f":"IF(I21>((I19-I18)*24),0,((I19-I18)*24-I21)*60)","v":0}]
["Tidpunkt, vindriktning, vindstyrka och segelföring, några deltagares startnr.",null,null,null,null,null,"Seglad distans (start - mål)",null,null,null,"D",{"$f":"Loggbok!E2","v":0}]
["2. Vid rundning av punkt",null,null,null,null,null,"Avdrag 1)","S",{"$f":"I4","v":24},"timmar","A",{"$f":"IF(L19>0,(2*L20*L19)/(I21*60),0)","v":0}]
["Samma anteckningar som vid start samt punktnummer och distans från närmaste föregående punkt.",null,null,null,null,null,"Resulterande distans",null,null,null,"R",{"$f":"+L20-L21","v":0}]
[null,null,null,null,null,null,"1) Beräkning av distansavdrag göres enligt"]
["3. Då annan deltagare siktas mellan punkter",null,null,null,null,null,"denna formel där",null,null,"A = 2 x D x F / S x 60"]
["Den andres startnummer samt tidpunkt och position (om ett flertal deltagare siktas räcker det att anteckna endast någon eller några av dem).",null,null,null,null,null,"A = avdrag i M"]
[null,null,null,null,null,null,"D = seglad distans"]
["4. Vid tändning och släckning av lanternor",null,null,null,null,null,"F = försening i minuter"]
["Tidpunkt",null,null,null,null,null,"S = seglingsperiodens längd ( 12, 24 etc )"]
["5. Vid revning och segelskiftning",null,null,null,null,null,"Att båt, besättning och utrustning uppfyllt fodringarna för den typ av segling som ovan kryssmarkerats samt att loggboken är rätt förd och att föreskrivna anteckningar införts, intygas"]
["Åtgärd och tidpunkt"]
["6. Användning av motor i friläge för batteriladdning"]
["Tidpunkter för start och stopp"]
["7.Vid seglingsperiodens slut om båten då inte nått fram till mål"]
["Positionen"]
["8. Vid ev. tillfälligt avbrott i seglingen"]
["Tidpunkt, position och förfarande samt utförlig redogörelse för skälen till angivet förfarande."]
[null,null,null,null,null,null,"Ort ",null,null,null,"Datum"]
["9. Vid målgång"]
["Samma anteckningar som vid rundning av punkt"]
[]
{"$rows_left_out":23}
{"sheet":"Loggbok","index":1,"n_rows":105,"n_cols":14,"rows_kept":105,"cut":false,"hidden":false,"merged":[[0,2,0,3],[0,4,0,8],[1,2,1,3],[1,4,1,6]]}
[null,null,"Båtnamn",null,{"$f":"Sida1!G11","v":0},null,null,null,null,"Start-nr",{"$f":"Sida1!G9","v":0},null,"Timmar totalt","Medel- hastighet"]
[null,null,"Totalt seglad sträcka",null,{"$f":"SUM(G4:G100)","v":0},null,null,"SRS",{"$f":"Sida1!K13","v":0},"Korr sträcka",{"$f":"E2/I2","v":{"$error":"#DIV/0!"}},null,{"$f":"SUM(M5:M105)*24","v":0},{"$f":"IF(E2>0,E2/M2,\"\")","v":""}]
["Från","Till","Datum\n[åååå-mm-dd]","Tid\n[tt:mm]","Punkt",null,"Sträcka","Vind riktning","Vind   m/s","Segelföring","Övriga uppgifter",null,"Tid [tt:mm]","Hastighet [kt]"]
[null,{"$f":"IF(E4,VLOOKUP(E4,Avst!I:J,2,FALSE),\"\")","v":{"$error":"#VALUE!"}},null,null,{"$f":"Sida1!I9","v":"Startpunkt"},{"$f":"IF(E5,\"R\",\"M\")","v":"M"},null,null,null,null,null,{"$f":"C4+D4","v":"00:00:00"}]
[{"$f":"IF(E4,VLOOKUP(E4,Avst!I:J,2,FALSE),\"\")","v":{"$error":"#VALUE!"}},{"$f":"IF(E5,VLOOKUP(E5,Avst!I:J,2,FALSE),\"\")","v":""},null,null,null,{"$f":"IF(E6,\"R\",\"M\")","v":"M"},{"$f":"IF(E5,VLOOKUP(CONCATENATE(MIN(E4,E5),\"-\",MAX(E4,E5)),Avst!A:B,2,FALSE),\"\")","v":""},null,null,null,null,"00:00:00",{"$f":"IF(E5,L5-L4,\"\")","v":""},{"$f":"IF(E5,G5/M5/24,\"\")","v":""}]
[{"$f":"IF(E5,VLOOKUP(E5,Avst!I:J,2,FALSE),\"\")","v":""},{"$f":"IF(E6,VLOOKUP(E6,Avst!I:J,2,FALSE),\"\")","v":""},null,null,null,"M",{"$f":"IF(E6,VLOOKUP(CONCATENATE(MIN(E5,E6),\"-\",MAX(E5,E6)),Avst!A:B,2,FALSE),\"\")","v":""},null,null,null,null,"00:00:00","",""]
[{"$f":"IF(E6,VLOOKUP(E6,Avst!I:J,2,FALSE),\"\")","v":""},{"$f":"IF(E7,VLOOKUP(E7,Avst!I:J,2,FALSE),\"\")","v":""},null,null,null,"M",{"$f":"IF(E7,VLOOKUP(CONCATENATE(MIN(E6,E7),\"-\",MAX(E6,E7)),Avst!A:B,2,FALSE),\"\")","v":""},null,null,null,null,"00:00:00","",""]
[{"$f":"IF(E7,VLOOKUP(E7,Avst!I:J,2,FALSE),\"\")","v":""},{"$f":"IF(E8,VLOOKUP(E8,Avst!I:J,2,FALSE),\"\")","v":""},null,null,null,"M",{"$f":"IF(E8,VLOOKUP(CONCATENATE(MIN(E7,E8),\"-\",MAX(E7,E8)),Avst!A:B,2,FALSE),\"\")","v":""},null,null,null,null,"00:00:00","",""]
[{"$f":"IF(E8,VLOOKUP(E8,Avst!I:J,2,FALSE),\"\")","v":""},{"$f":"IF(E9,VLOOKUP(E9,Avst!I:J,2,FALSE),\"\")","v":""},null,null,null,"M",{"$f":"IF(E9,VLOOKUP(CONCATENATE(MIN(E8,E9),\"-\",MAX(E8,E9)),Avst!A:B,2,FALSE),\"\")","v":""},null,null,null,null,"00:00:00","",""]
[{"$f":"IF(E9,VLOOKUP(E9,Avst!I:J,2,FALSE),\"\")","v":""},{"$f":"IF(E10,VLOOKUP(E10,Avst!I:J,2,FALSE),\"\")","v":""},null,null,null,"M",{"$f":"IF(E10,VLOOKUP(CONCATENATE(MIN(E9,E10),\"-\",MAX(E9,E10)),Avst!A:B,2,FALSE),\"\")","v":""},null,null,null,null,"00:00:00","",""]
[{"$f":"IF(E10,VLOOKUP(E10,Avst!I:J,2,FALSE),\"\")","v":""},{"$f":"IF(E11,VLOOKUP(E11,Avst!I:J,2,FALSE),\"\")","v":""},null,null,null,"M",{"$f":"IF(E11,VLOOKUP(CONCATENATE(MIN(E10,E11),\"-\",MAX(E10,E11)),Avst!A:B,2,FALSE),\"\")","v":""},null,null,null,null,"00:00:00","",""]
[{"$f":"IF(E11,VLOOKUP(E11,Avst!I:J,2,FALSE),\"\")","v":""},{"$f":"IF(E12,VLOOKUP(E12,Avst!I:J,2,FALSE),\"\")","v":""},null,null,null,"M",{"$f":"IF(E12,VLOOKUP(CONCATENATE(MIN(E11,E12),\"-\",MAX(E11,E12)),Avst!A:B,2,FALSE),\"\")","v":""},null,null,null,null,"00:00:00","",""]
[{"$f":"IF(E12,VLOOKUP(E12,Avst!I:J,2,FALSE),\"\")","v":""},{"$f":"IF(E13,VLOOKUP(E13,Avst!I:J,2,FALSE),\"\")","v":""},null,null,null,"M",{"$f":"IF(E13,VLOOKUP(CONCATENATE(MIN(E12,E13),\"-\",MAX(E12,E13)),Avst!A:B,2,FALSE),\"\")","v":""},null,null,null,null,"00:00:00","",""]
[{"$f":"IF(E13,VLOOKUP(E13,Avst!I:J,2,FALSE),\"\")","v":""},{"$f":"IF(E14,VLOOKUP(E14,Avst!I:J,2,FALSE),\"\")","v":""},null,null,null,"M",{"$f":"IF(E14,VLOOKUP(CONCATENATE(MIN(E13,E14),\"-\",MAX(E13,E14)),Avst!A:B,2,FALSE),\"\")","v":""},null,null,null,null,"00:00:00","",""]
[{"$f":"IF(E14,VLOOKUP(E14,Avst!I:J,2,FALSE),\"\")","v":""},{"$f":"IF(E15,VLOOKUP(E15,Avst!I:J,2,FALSE),\"\")","v":""},null,null,null,"M",{"$f":"IF(E15,VLOOKUP(CONCATENATE(MIN(E14,E15),\"-\",MAX(E14,E15)),Avst!A:B,2,FALSE),\"\")","v":""},null,null,null,null,"00:00:00","",""]
[{"$f":"IF(E15,VLOOKUP(E15,Avst!I:J,2,FALSE),\"\")","v":""},{"$f":"IF(E16,VLOOKUP(E16,Avst!I:J,2,FALSE),\"\")","v":""},null,null,null,"M",{"$f":"IF(E16,VLOOKUP(CONCATENATE(MIN(E15,E16),\"-\",MAX(E15,E16)),Avst!A:B,2,FALSE),\"\")","v":""},null,null,null,null,"00:00:00","",""]
[{"$f":"IF(E16,VLOOKUP(E16,Avst!I:J,2,FALSE),\"\")","v":""},{"$f":"IF(E17,VLOOKUP(E17,Avst!I:J,2,FALSE),\"\")","v":""},null,null,null,"M",{"$f":"IF(E17,VLOOKUP(CONCATENATE(MIN(E16,E17),\"-\",MAX(E16,E17)),Avst!A:B,2,FALSE),\"\")","v":""},null,null,null,null,"00:00:00","",""]
[{"$f":"IF(E17,VLOOKUP(E17,Avst!I:J,2,FALSE),\"\")","v":""},{"$f":"IF(E18,VLOOKUP(E18,Avst!I:J,2,FALSE),\"\")","v":""},null,null,null,"M",{"$f":"IF(E18,VLOOKUP(CONCATENATE(MIN(E17,E18),\"-\",MAX(E17,E18)),Avst!A:B,2,FALSE),\"\")","v":""},null,null,null,null,"00:00:00","",""]
[{"$f":"IF(E18,VLOOKUP(E18,Avst!I:J,2,FALSE),\"\")","v":""},{"$f":"IF(E19,VLOOKUP(E19,Avst!I:J,2,FALSE),\"\")","v":""},null,null,null,"M",{"$f":"IF(E19,VLOOKUP(CONCATENATE(MIN(E18,E19),\"-\",MAX(E18,E19)),Avst!A:B,2,FALSE),\"\")","v":""},null,null,null,null,"00:00:00","",""]
[{"$f":"IF(E19,VLOOKUP(E19,Avst!I:J,2,FALSE),\"\")","v":""},{"$f":"IF(E20,VLOOKUP(E20,Avst!I:J,2,FALSE),\"\")","v":""},null,null,null,"M",{"$f":"IF(E20,VLOOKUP(CONCATENATE(MIN(E19,E20),\"-\",MAX(E19,E20)),Avst!A:B,2,FALSE),\"\")","v":""},null,null,null,null,"00:00:00","",""]
[{"$f":"IF(E20,VLOOKUP(E20,Avst!I:J,2,FALSE),\"\")","v":""},{"$f":"IF(E21,VLOOKUP(E21,Avst!I:J,2,FALSE),\"\")","v":""},null,null,null,"M",{"$f":"IF(E21,VLOOKUP(CONCATENATE(MIN(E20,E21),\"-\",MAX(E20,E21)),Avst!A:B,2,FALSE),\"\")","v":""},null,null,null,null,"00:00:00","",""]
[{"$f":"IF(E21,VLOOKUP(E21,Avst!I:J,2,FALSE),\"\")","v":""},{"$f":"IF(E22,VLOOKUP(E22,Avst!I:J,2,FALSE),\"\")","v":""},null,null,null,"M",{"$f":"IF(E22,VLOOKUP(CONCATENATE(MIN(E21,E22),\"-\",MAX(E21,E22)),Avst!A:B,2,FALSE),\"\")","v":""},null,null,null,null,"00:00:00","",""]
[{"$f":"IF(E22,VLOOKUP(E22,Avst!I:J,2,FALSE),\"\")","v":""},{"$f":"IF(E23,VLOOKUP(E23,Avst!I:J,2,FALSE),\"\")","v":""},null,null,null,"M",{"$f":"IF(E23,VLOOKUP(CONCATENATE(MIN(E22,E23),\"-\",MAX(E22,E23)),Avst!A:B,2,FALSE),\"\")","v":""},null,null,null,null,"00:00:00","",""]
[{"$f":"IF(E23,VLOOKUP(E23,Avst!I:J,2,FALSE),\"\")","v":""},{"$f":"IF(E24,VLOOKUP(E24,Avst!I:J,2,FALSE),\"\")","v":""},null,null,null,"M",{"$f":"IF(E24,VLOOKUP(CONCATENATE(MIN(E23,E24),\"-\",MAX(E23,E24)),Avst!A:B,2,FALSE),\"\")","v":""},null,null,null,null,"00:00:00","",""]
[{"$f":"IF(E24,VLOOKUP(E24,Avst!I:J,2,FALSE),\"\")","v":""},{"$f":"IF(E25,VLOOKUP(E25,Avst!I:J,2,FALSE),\"\")","v":""},null,null,null,"M",{"$f":"IF(E25,VLOOKUP(CONCATENATE(MIN(E24,E25),\"-\",MAX(E24,E25)),Avst!A:B,2,FALSE),\"\")","v":""},null,null,null,null,"00:00:00","",""]
[{"$f":"IF(E25,VLOOKUP(E25,Avst!I:J,2,FALSE),\"\")","v":""},{"$f":"IF(E26,VLOOKUP(E26,Avst!I:J,2,FALSE),\"\")","v":""},null,null,null,"M",{"$f":"IF(E26,VLOOKUP(CONCATENATE(MIN(E25,E26),\"-\",MAX(E25,E26)),Avst!A:B,2,FALSE),\"\")","v":""},null,null,null,null,"00:00:00","",""]
[{"$f":"IF(E26,VLOOKUP(E26,Avst!I:J,2,FALSE),\"\")","v":""},{"$f":"IF(E27,VLOOKUP(E27,Avst!I:J,2,FALSE),\"\")","v":""},null,null,null,"M",{"$f":"IF(E27,VLOOKUP(CONCATENATE(MIN(E26,E27),\"-\",MAX(E26,E27)),Avst!A:B,2,FALSE),\"\")","v":""},null,null,null,null,"00:00:00","",""]
[{"$f":"IF(E27,VLOOKUP(E27,Avst!I:J,2,FALSE),\"\")","v":""},{"$f":"IF(E28,VLOOKUP(E28,Avst!I:J,2,FALSE),\"\")","v":""},null,null,null,"M",{"$f":"IF(E28,VLOOKUP(CONCATENATE(MIN(E27,E28),\"-\",MAX(E27,E28)),Avst!A:B,2,FALSE),\"\")","v":""},null,null,null,null,"00:00:00","",""]
[{"$f":"IF(E28,VLOOKUP(E28,Avst!I:J,2,FALSE),\"\")","v":""},{"$f":"IF(E29,VLOOKUP(E29,Avst!I:J,2,FALSE),\"\")","v":""},null,null,null,"M",{"$f":"IF(E29,VLOOKUP(CONCATENATE(MIN(E28,E29),\"-\",MAX(E28,E29)),Avst!A:B,2,FALSE),\"\")","v":""},null,null,null,null,"00:00:00","",""]
[{"$f":"IF(E29,VLOOKUP(E29,Avst!I:J,2,FALSE),\"\")","v":""},{"$f":"IF(E30,VLOOKUP(E30,Avst!I:J,2,FALSE),\"\")","v":""},null,null,null,"M",{"$f":"IF(E30,VLOOKUP(CONCATENATE(MIN(E29,E30),\"-\",MAX(E29,E30)),Avst!A:B,2,FALSE),\"\")","v":""},null,null,null,null,"00:00:00","",""]
[{"$f":"IF(E30,VLOOKUP(E30,Avst!I:J,2,FALSE),\"\")","v":""},{"$f":"IF(E31,VLOOKUP(E31,Avst!I:J,2,FALSE),\"\")","v":""},null,null,null,"M",{"$f":"IF(E31,VLOOKUP(CONCATENATE(MIN(E30,E31),\"-\",MAX(E30,E31)),Avst!A:B,2,FALSE),\"\")","v":""},null,null,null,null,"00:00:00","",""]
[{"$f":"IF(E31,VLOOKUP(E31,Avst!I:J,2,FALSE),\"\")","v":""},{"$f":"IF(E32,VLOOKUP(E32,Avst!I:J,2,FALSE),\"\")","v":""},null,null,null,"M",{"$f":"IF(E32,VLOOKUP(CONCATENATE(MIN(E31,E32),\"-\",MAX(E31,E32)),Avst!A:B,2,FALSE),\"\")","v":""},null,null,null,null,"00:00:00","",""]
[{"$f":"IF(E32,VLOOKUP(E32,Avst!I:J,2,FALSE),\"\")","v":""},{"$f":"IF(E33,VLOOKUP(E33,Avst!I:J,2,FALSE),\"\")","v":""},null,null,null,"M",{"$f":"IF(E33,VLOOKUP(CONCATENATE(MIN(E32,E33),\"-\",MAX(E32,E33)),Avst!A:B,2,FALSE),\"\")","v":""},null,null,null,null,"00:00:00","",""]
[{"$f":"IF(E33,VLOOKUP(E33,Avst!I:J,2,FALSE),\"\")","v":""},{"$f":"IF(E34,VLOOKUP(E34,Avst!I:J,2,FALSE),\"\")","v":""},null,null,null,"M",{"$f":"IF(E34,VLOOKUP(CONCATENATE(MIN(E33,E34),\"-\",MAX(E33,E34)),Avst!A:B,2,FALSE),\"\")","v":""},null,null,null,null,"00:00:00","",""]
[{"$f":"IF(E34,VLOOKUP(E34,Avst!I:J,2,FALSE),\"\")","v":""},{"$f":"IF(E35,VLOOKUP(E35,Avst!I:J,2,FALSE),\"\")","v":""},null,null,null,"M",{"$f":"IF(E35,VLOOKUP(CONCATENATE(MIN(E34,E35),\"-\",MAX(E34,E35)),Avst!A:B,2,FALSE),\"\")","v":""},null,null,null,null,"00:00:00","",""]
[{"$f":"IF(E35,VLOOKUP(E35,Avst!I:J,2,FALSE),\"\")","v":""},{"$f":"IF(E36,VLOOKUP(E36,Avst!I:J,2,FALSE),\"\")","v":""},null,null,null,"M",{"$f":"IF(E36,VLOOKUP(CONCATENATE(MIN(E35,E36),\"-\",MAX(E35,E36)),Avst!A:B,2,FALSE),\"\")","v":""},null,null,null,null,{"$f":"C36+D36","v":"00:00:00"},"",""]
[{"$f":"IF(E36,VLOOKUP(E36,Avst!I:J,2,FALSE),\"\")","v":""},{"$f":"IF(E37,VLOOKUP(E37,Avst!I:J,2,FALSE),\"\")","v":""},null,null,null,"M",{"$f":"IF(E37,VLOOKUP(CONCATENATE(MIN(E36,E37),\"-\",MAX(E36,E37)),Avst!A:B,2,FALSE),\"\")","v":""},null,null,null,null,"00:00:00",{"$f":"IF(E37,L37-L36,\"\")","v":""},{"$f":"IF(E37,G37/M37/24,\"\")","v":""}]
[{"$f":"IF(E37,VLOOKUP(E37,Avst!I:J,2,FALSE),\"\")","v":""},{"$f":"IF(E38,VLOOKUP(E38,Avst!I:J,2,FALSE),\"\")","v":""},null,null,null,"M",{"$f":"IF(E38,VLOOKUP(CONCATENATE(MIN(E37,E38),\"-\",MAX(E37,E38)),Avst!A:B,2,FALSE),\"\")","v":""},null,null,null,null,"00:00:00","",""]
[{"$f":"IF(E38,VLOOKUP(E38,Avst!I:J,2,FALSE),\"\")","v":""},{"$f":"IF(E39,VLOOKUP(E39,Avst!I:J,2,FALSE),\"\")","v":""},null,null,null,"M",{"$f":"IF(E39,VLOOKUP(CONCATENATE(MIN(E38,E39),\"-\",MAX(E38,E39)),Avst!A:B,2,FALSE),\"\")","v":""},null,null,null,null,"00:00:00","",""]
[{"$f":"IF(E39,VLOOKUP(E39,Avst!I:J,2,FALSE),\"\")","v":""},{"$f":"IF(E40,VLOOKUP(E40,Avst!I:J,2,FALSE),\"\")","v":""},null,null,null,"M",{"$f":"IF(E40,VLOOKUP(CONCATENATE(MIN(E39,E40),\"-\",MAX(E39,E40)),Avst!A:B,2,FALSE),\"\")","v":""},null,null,null,null,"00:00:00","",""]
{"$rows_left_out":66}
{"sheet":"Avst","index":2,"n_rows":1382,"n_cols":14,"rows_kept":1382,"cut":false,"hidden":false,"merged":[]}
["Sträcka","Avstånd","2Kust 3Hav",null,"Sträckor Stockholm","Avst",null,null,"Punkt","Namn",null,"Startpunkt",null,"Seglingsperiod"]
["311-317",10.8,2,null,"617-637",15.5,null,null,311,"Sandhamn",null,416,null,12]
["311-321",16.5,3,null,"626-637",14,null,null,317,"Kristianopel",null,419,null,24]
["311-322",25.3,3,null,"633-637",4.5,null,null,321,"Ölands rev",null,385,null,48]
["311-327",20.9,3,null,"636-637",5.9,null,null,322,"Ölands södra grund",null,396,null,72]
["311-327",25.3,3,null,"637-639",2.5,null,null,327,"Utgrunden",null,410,null,96]
["317-321",13.4,3,null,"637-642",9,null,null,328,"Segerstad",null,412,null,120]
["317-322",21.8,3,null,"637-644",17,null,null,329,"Mittgrunden",null,414]
["317-327",10.1,2,null,"637-647",19.899999999999999,null,null,330,"Mörbylånga",null,415]
["317-329",15.8,2,null,"639-670",32.200000000000003,null,null,332,"Trädgårdsgr.",null,416]
["321-322",9,3,null,"642-665",23.4,null,null,333,"Ölandsbron",null,418]
["321-327",17.3,3,null,"642-670",26.3,null,null,336,"Sillåsen",null,419]
["321-328",17.399999999999999,3,null,"648-650",9.4,null,null,338,"Kapelludden",null,421]
["321-328",20.9,3,null,"648-652",18.3,null,null,339,"Solidsgrund",null,429]
["321-500",73.5,3,null,"648-655",20.7,null,null,341,"Slottsbredan",null,441]
["321-502",87.5,3,null,"648-664",14.5,null,null,342,"Stengrund",null,442]
["322-328",18.3,3,null,"648-665",21,null,null,344,"Dämman",null,443]
["322-500",69,3,null,"648-671",20.5,null,null,345,"Sandvik",null,447]
["322-502",84.5,3,null,"648-683",38.6,null,null,347,"Norstö",null,448]
["327-329",6.4,2,null,"649-650",3.1,null,null,348,"Klockaren",null,449]
["327-330",10.6,2,null,"650-652",9,null,null,350,"Horns udde",null,450]
["327-332",15.7,2,null,"650-654",13,null,null,351,"Blå Jungfrun",null,452]
["328-338",28.6,3,null,"650-655",11.6,null,null,353,"Oskarshamn",null,455]
["328-500",59,3,null,"650-656",4.7,null,null,354,"Finnrevet",null,456]
["328-502",70.5,3,null,"650-657",6,null,null,356,"Knölen",null,457]
["329-330",5,2,null,"650-659",12.3,null,null,357,"Bennen",null,458]
["329-332",9.6,2,null,"650-664",15.4,null,null,359,"Byxelkrok",null,460]
["330-332",5.0999999999999996,2,null,"652-655",3.5,null,null,360,"Hommeskär",null,461]
["332-333",3.4,2,null,"652-656",6.5,null,null,363,"Flisgrund",null,531]
["333-336",6.1,2,null,"652-659",5.2,null,null,364,"Bredgrund",null,532]
["336-339",7.4,2,null,"652-661",7.9,null,null,366,"Blackan",null,533]
["336-341",10.5,2,null,"652-662",9,null,null,367,"Ölands norra grund"]
["338-356",30.3,3,null,"652-664",20.2,null,null,369,"Strupö Ljungsk."]
["338-500",41,3,null,"653-654",1.5,null,null,370,"Mannen"]
["338-501",43.8,3,null,"653-655",2.6,null,null,372,"Knolls Grund"]
["338-502",44.6,3,null,"654-655",1.8,null,null,373,"Solstadsgruva"]
["338-504",56,3,null,"654-659",2.2000000000000002,null,null,375,"Vinkelgrund"]
["339-341",3.3,2,null,"655-656",8,null,null,376,"V Eknö"]
["339-345",14.4,2,null,"655-659",3.3,null,null,378,"Alhällan"]
["341-342",4.2,2,null,"655-661",6.3,null,null,379,"Fyrken"]
{"$rows_left_out":1342}